Reaction Details
TargetPeptidyl-prolyl cis-trans isomerase FKBP1A
LigandBDBM23371
Substrate/CompetitorBDBM23318
Meas. Tech.Peptidyl Prolyl Isomerase (PPIase) Inibition Assay
Ki 2300±n/a nM
Citation Hudack, RABarta, NSGuo, CDeal, JDong, LFay, LKCaprathe, BChatterjee, AVanderpool, DBigge, CShowalter, RBender, SAugelli-Szafran, CELunney, EHou, X Design, synthesis, and biological activity of novel polycyclic aza-amide FKBP12 ligands. J Med Chem49:1202-6 (2006) 
 
Peptidyl-prolyl cis-trans isomerase FKBP1A
Name:Peptidyl-prolyl cis-trans isomerase FKBP1A
Type:Isomerase
Mol. Mass.:11911.51
Organism:Bos taurus (bovine)
Description:The enzyme was purified from calf thymus. The collected protein was further applied to Sephacryl column, and the fraction contained high PPIase activity was pooled.
Residue:108
BDBM23371
BDBM23318
NameBDBM23371
Synonyms:1-{4,6-dimethoxy-12-oxo-11,17-diazatetracyclo[11.3.1.0^{2,11}.0^{3,8}]heptadeca-3(8),4,6-trien-17-yl}-2-(1H-indol-2-yl)ethane-1,2-dione | Tetracyclic aza-amide, 7e
TypeSmall organic molecule
Emp. Form.C27H27N3O5
Mol. Mass.473.5204
SMILESCOc1cc2CCN3C(C4CCCC(N4C(=O)C(=O)c4cc5ccccc5[nH]4)C3=O)c2c(OC)c1