Reaction Details
TargetPeptidyl-prolyl cis-trans isomerase FKBP1A
LigandBDBM23394
Substrate/CompetitorBDBM23318
Meas. Tech.Peptidyl Prolyl Isomerase (PPIase) Inibition Assay
Ki 590±n/a nM
Citation Hudack, RABarta, NSGuo, CDeal, JDong, LFay, LKCaprathe, BChatterjee, AVanderpool, DBigge, CShowalter, RBender, SAugelli-Szafran, CELunney, EHou, X Design, synthesis, and biological activity of novel polycyclic aza-amide FKBP12 ligands. J Med Chem49:1202-6 (2006) 
 
Peptidyl-prolyl cis-trans isomerase FKBP1A
Name:Peptidyl-prolyl cis-trans isomerase FKBP1A
Type:Isomerase
Mol. Mass.:11911.51
Organism:Bos taurus (bovine)
Description:The enzyme was purified from calf thymus. The collected protein was further applied to Sephacryl column, and the fraction contained high PPIase activity was pooled.
Residue:108
BDBM23394
BDBM23318
NameBDBM23394
Synonyms:6-methoxy-12-oxo-N-(2,4,5-trifluorophenyl)-11,17-diazatetracyclo[11.3.1.0^{2,11}.0^{3,8}]heptadeca-3(8),4,6-triene-17-sulfonamide | Tetracyclic aza-amide, 14h
TypeSmall organic molecule
Emp. Form.C22H22F3N3O4S
Mol. Mass.481.488
SMILESCOc1ccc2C3C4CCCC(N4S(=O)(=O)Nc4cc(F)c(F)cc4F)C(=O)N3CCc2c1