Reaction Details
TargetDisintegrin and metalloproteinase domain-containing protein 17 [215-477,S266A,N452Q]
LigandBDBM23454
Substrate/CompetitorBDBM23453
Meas. Tech.TACE Inhibition Assay
pH7.3±n/a
Temperature295.15±n/a K
Ki 12±n/a nM
Citation Zhu, ZMazzola, RSinning, LMcKittrick, BNiu, XLundell, DSun, JOrth, PGuo, ZMadison, VIngram, RBeyer, BM Discovery of novel hydroxamates as highly potent tumor necrosis factor-alpha converting enzyme inhibitors: Part I--discovery of two binding modes. J Med Chem51:725-36 (2008) 
 
Disintegrin and metalloproteinase domain-containing protein 17 [215-477,S266A,N452Q]
Name:Disintegrin and metalloproteinase domain-containing protein 17 [215-477,S266A,N452Q]
Type:Single-pass type I membrane protein; metalloprotease
Mol. Mass.:29695.98
Organism:Homo sapiens (Human)
Description:The catalytic domain of recombinant human TNF-converting enzyme (residues 215-477) with two mutations (S266A and N452Q) and a 6xHis was purified from the baculovirus/Hi5 cells expression system.
Residue:263
BDBM23454
BDBM23453
NameBDBM23454
Synonyms:CHEMBL270558 methyl (1R,2R)-2-(hydroxycarbamoyl)-1-{3-[(2-methylquinolin-4-yl)methoxy]phenyl}cyclopropane-1-carboxylate
TypeSmall organic molecule
Emp. Form.C23H22N2O5
Mol. Mass.406.4312
SMILESCOC(=O)[C@@]1(C[C@H]1C(=O)NO)c1cccc(OCc2cc(C)nc3ccccc23)c1