Reaction Details
Target72 kDa type IV collagenase
LigandBDBM23498
Substrate/CompetitorBDBM23499
Meas. Tech.MMP Inhibition Assay
pH7.4±n/a
Temperature295.15±n/a K
IC50 4.7±n/a nM
Citation Zhang, YXu, JLevin, JHegen, MLi, GRobertshaw, HBrennan, FCummons, TClarke, DVansell, NNickerson-Nutter, CBarone, DMohler, KBlack, RSkotnicki, JGibbons, JFeldmann, MFrost, PLarsen, GLin, LL Identification and characterization of 4-[[4-(2-butynyloxy)phenyl]sulfonyl]-N-hydroxy-2,2-dimethyl-(3S)thiomorpholinecarboxamide (TMI-1), a novel dual tumor necrosis factor-alpha-converting enzyme/matrix metalloprotease inhibitor for the treatment of rheumatoid arthritis. J Pharmacol Exp Ther309:348-55 (2004) 
 
72 kDa type IV collagenase
Name:72 kDa type IV collagenase
Type:Enzyme
Mol. Mass.:73870.36
Organism:Homo sapiens (Human)
Description: P08253
Residue:660
BDBM23498
BDBM23499
NameBDBM23498
Synonyms:(3S)-4-{[4-(but-2-yn-1-yloxy)benzene]sulfonyl}-N-hydroxy-2,2-dimethylthiomorpholine-3-carboxamide TMI-1
TypeSmall organic molecule
Emp. Form.C17H22N2O5S2
Mol. Mass.398.497
SMILESCC#CCOc1ccc(cc1)S(=O)(=O)N1CCSC(C)(C)[C@@H]1C(=O)NO