Reaction Details
Target3-oxoacyl-[acyl-carrier-protein] synthase 3
LigandBDBM23585
Substrate/CompetitorBDBM3158
Meas. Tech.FabD/FabH Coupled Assay
pH7±n/a
Temperature295.15±n/a K
IC50>100000±n/a nM
Citation Nie, ZPerretta, CLu, JSu, YMargosiak, SGajiwala, KSCortez, JNikulin, VYager, KMAppelt, KChu, S Structure-based design, synthesis, and study of potent inhibitors of beta-ketoacyl-acyl carrier protein synthase III as potential antimicrobial agents. J Med Chem48:1596-609 (2005) 
 
3-oxoacyl-[acyl-carrier-protein] synthase 3
Name:3-oxoacyl-[acyl-carrier-protein] synthase 3
Type:Acyltransferase; homodimer
Mol. Mass.:34269.34
Organism:Haemophilus influenzae
Description:The H. influenzae FabH was cloned, and protein was expressed in E. coli.
Residue:316
BDBM23585
BDBM3158
NameBDBM23585
Synonyms:(3-Phenoxybenzoylamino)benzoic acid deriv., 24i | 2-{[4-(4-methanesulfonylphenyl)-3-phenoxybenzene]amido}benzoic acid
TypeSmall organic molecule
Emp. Form.C27H21NO6S
Mol. Mass.487.524
SMILESCS(=O)(=O)c1ccc(cc1)-c1ccc(cc1Oc1ccccc1)C(=O)Nc1ccccc1C(O)=O