Reaction Details
Target3-oxoacyl-[acyl-carrier-protein] synthase 3
LigandBDBM23605
Substrate/CompetitorBDBM3158
Meas. Tech.FabD/FabH Coupled Assay
IC50 250±n/a nM
Citation Nie, ZPerretta, CLu, JSu, YMargosiak, SGajiwala, KSCortez, JNikulin, VYager, KMAppelt, KChu, S Structure-based design, synthesis, and study of potent inhibitors of beta-ketoacyl-acyl carrier protein synthase III as potential antimicrobial agents. J Med Chem48:1596-609 (2005) 
 
3-oxoacyl-[acyl-carrier-protein] synthase 3
Name:3-oxoacyl-[acyl-carrier-protein] synthase 3
Type:Acyltransferase; homodimer
Mol. Mass.:35176.53
Organism:Enterococcus faecalis
Description:The E. faecalis FabH was cloned, and protein was expressed in E. coli.
Residue:321
BDBM23605
BDBM3158
NameBDBM23605
Synonyms:(3-Phenoxybenzoylamino)benzoic acid deriv., 24o | 2-{[4-(4-chloro-3-methylphenyl)-3-phenoxybenzene]amido}benzoic acid
TypeSmall organic molecule
Emp. Form.C27H20ClNO4
Mol. Mass.457.905
SMILESCc1cc(ccc1Cl)-c1ccc(cc1Oc1ccccc1)C(=O)Nc1ccccc1C(O)=O