Reaction Details
TargetBeta-secretase 1 [1-460]
LigandBDBM50393100
Substrate/Competitorn/a
Meas. Tech.FRET Assay
IC50 0.630±n/a nM
Citation Csjernyik, GKarlstrom, SKers, AKolmodin, KNylof, MOhberg, LRakos, LSandberg, LSehgelmeble, FSoderman, PSwahn, BVon Berg, S Compounds and their use as BACE inhibitors US Patent US9918985 Publication Date 3/20/2018
 
Beta-secretase 1 [1-460]
Name:Beta-secretase 1 [1-460]
Type:Protein
Mol. Mass.:50987.78
Organism:Homo sapiens (Human)
Description:P56817[1-460]
Residue:460
BDBM50393100
NameBDBM50393100
Synonyms:CHEMBL2152915 US9918985, Example 125
TypeSmall organic molecule
Emp. Form.C25H25ClN4O
Mol. Mass.432.945
SMILESCO[C@H]1CC[C@@]2(Cc3ccc(cc3C22N=C(C)C(N)=N2)-c2cc(Cl)cc(c2)C#N)CC1