Reaction Details
TargetBeta-secretase 1 [1-460]
LigandBDBM136856
Substrate/Competitorn/a
Meas. Tech.FRET Assay
IC50 0.840±n/a nM
Citation Csjernyik, GKarlstrom, SKers, AKolmodin, KNylof, MOhberg, LRakos, LSandberg, LSehgelmeble, FSoderman, PSwahn, BVon Berg, S Compounds and their use as BACE inhibitors US Patent US9918985 Publication Date 3/20/2018
 
Beta-secretase 1 [1-460]
Name:Beta-secretase 1 [1-460]
Type:Protein
Mol. Mass.:50987.78
Organism:Homo sapiens (Human)
Description:P56817[1-460]
Residue:460
BDBM136856
NameBDBM136856
Synonyms:US10231967, Example 92-Isomer-1 US9918985, Example 92 Isomer 1
TypeSmall organic molecule
Emp. Form.C26H28N4O2
Mol. Mass.428.5261
SMILESCO[C@H]1CC[C@@]2(Cc3ccc(cc3[C@]22N=C(C)C(N)=N2)-c2cc(OC)cc(c2)C#N)CC1