Reaction Details
TargetNeutrophil elastase
LigandBDBM23720
Substrate/CompetitorBDBM23699
Meas. Tech.Human Neutrophil Elastase Inhibition Assay
pH7.5±n/a
Temperature298.15±n/a K
Ki 9000±n/a nM
Citation Schepetkin, IAKhlebnikov, AIQuinn, MT N-benzoylpyrazoles are novel small-molecule inhibitors of human neutrophil elastase. J Med Chem50:4928-38 (2007) 
 
Neutrophil elastase
Name:Neutrophil elastase
Type:Enzyme
Mol. Mass.:28532.38
Organism:Homo sapiens (Human)
Description:P08246
Residue:267
BDBM23720
BDBM23699
NameBDBM23720
Synonyms:1-[(4-tert-butylphenyl)carbonyl]-4-chloro-1H-pyrazole | N-Benzoylpyrazole deriv., 28
TypeSmall organic molecule
Emp. Form.C14H15ClN2O
Mol. Mass.262.735
SMILESCC(C)(C)c1ccc(cc1)C(=O)n1cc(Cl)cn1