Reaction Details
TargetChymotrypsin-C
LigandBDBM23703
Substrate/CompetitorBDBM23729
Meas. Tech.Human Neutrophil Elastase Inhibition Assay
IC50 2700±n/a nM
Citation Schepetkin, IAKhlebnikov, AIQuinn, MT N-benzoylpyrazoles are novel small-molecule inhibitors of human neutrophil elastase. J Med Chem50:4928-38 (2007) 
 
Chymotrypsin-C
Name:Chymotrypsin-C
Type:Enzyme
Mol. Mass.:29487.98
Organism:Homo sapiens (Human)
Description:Q99895
Residue:268
BDBM23703
BDBM23729
NameBDBM23703
Synonyms:1-benzoyl-4-nitro-1H-pyrazole | N-Benzoylpyrazole deriv., 5
TypeSmall organic molecule
Emp. Form.C10H7N3O3
Mol. Mass.217.1809
SMILES[O-][N+](=O)c1cnn(c1)C(=O)c1ccccc1