Reaction Details
TargetChymotrypsin-C
LigandBDBM23706
Substrate/CompetitorBDBM23729
Meas. Tech.Human Neutrophil Elastase Inhibition Assay
IC50 125±n/a nM
Citation Schepetkin, IAKhlebnikov, AIQuinn, MT N-benzoylpyrazoles are novel small-molecule inhibitors of human neutrophil elastase. J Med Chem50:4928-38 (2007) 
 
Chymotrypsin-C
Name:Chymotrypsin-C
Type:Enzyme
Mol. Mass.:29487.98
Organism:Homo sapiens (Human)
Description:Q99895
Residue:268
BDBM23706
BDBM23729
NameBDBM23706
Synonyms:1-[(3,4-dichlorophenyl)carbonyl]-1H-pyrazole | N-Benzoylpyrazole deriv., 8
TypeSmall organic molecule
Emp. Form.C10H6Cl2N2O
Mol. Mass.241.073
SMILESClc1ccc(cc1Cl)C(=O)n1cccn1