Reaction Details
TargetChymotrypsin-C
LigandBDBM23708
Substrate/CompetitorBDBM23729
Meas. Tech.Human Neutrophil Elastase Inhibition Assay
IC50 1800±n/a nM
Citation Schepetkin, IAKhlebnikov, AIQuinn, MT N-benzoylpyrazoles are novel small-molecule inhibitors of human neutrophil elastase. J Med Chem50:4928-38 (2007) 
 
Chymotrypsin-C
Name:Chymotrypsin-C
Type:Enzyme
Mol. Mass.:29487.98
Organism:Homo sapiens (Human)
Description:Q99895
Residue:268
BDBM23708
BDBM23729
NameBDBM23708
Synonyms:4-bromo-1-[(2,6-difluorophenyl)carbonyl]-1H-pyrazole | N-Benzoylpyrazole deriv., 13
TypeSmall organic molecule
Emp. Form.C10H5BrF2N2O
Mol. Mass.287.06
SMILESFc1cccc(F)c1C(=O)n1cc(Br)cn1