Reaction Details
TargetSerine/threonine-protein kinase pim-1
LigandBDBM376820
Substrate/Competitorn/a
Meas. Tech.Enzyme Assay
IC50<10±n/a nM
Citation Vechorkin, OLi, YSokolsky, AWang, AZhu, WZhuo, J Heterocyclic compounds useful as pim kinase inhibitors US Patent US9920032 Publication Date 3/20/2018
 
Serine/threonine-protein kinase pim-1
Name:Serine/threonine-protein kinase pim-1
Type:Protein
Mol. Mass.:35681.82
Organism:Homo sapiens (Human)
Description:P11309
Residue:313
BDBM376820
NameBDBM376820
Synonyms:N-(4-((1R,3S,5S)-3-Amino-5-methylcyclohexyl)pyridin-3-yl)-5-fluoro-3-(methyl)tetrahydro-2H-pyran-3-yl)amino)quinoline-8-carboxamide US11053215, Example 151 | US9920032, Example 151
TypeSmall organic molecule
Emp. Form.C28H34FN5O2
Mol. Mass.491.6003
SMILESC[C@@H]1C[C@H](N)C[C@@H](C1)c1ccncc1NC(=O)c1ccc(F)c2cc(cnc12)N(C)C1CCCOC1