Reaction Details
TargetSerine/threonine-protein kinase pim-3
LigandBDBM376822
Substrate/Competitorn/a
Meas. Tech.Enzyme Assay
IC50<10±n/a nM
Citation Vechorkin, OLi, YSokolsky, AWang, AZhu, WZhuo, J Heterocyclic compounds useful as pim kinase inhibitors US Patent US9920032 Publication Date 3/20/2018
 
Serine/threonine-protein kinase pim-3
Name:Serine/threonine-protein kinase pim-3
Type:Protein
Mol. Mass.:35888.19
Organism:Homo sapiens (Human)
Description:Q86V86
Residue:326
BDBM376822
NameBDBM376822
Synonyms:N-(4-((1R,3S,5S)-3-Amino-5-methylcyclohexyl)pyridin-3-yl)-5-fluoro-3-(imidazo[1,2-a]pyridin-6-yl)methyl)amino)quinoline-8-carboxamide US11053215, Example 153 | US9920032, Example 153
TypeSmall organic molecule
Emp. Form.C30H30FN7O
Mol. Mass.523.6039
SMILESC[C@@H]1C[C@H](N)C[C@@H](C1)c1ccncc1NC(=O)c1ccc(F)c2cc(cnc12)N(C)c1ccc2nccn2c1