Reaction Details
TargetSerine/threonine-protein kinase pim-3
LigandBDBM376824
Substrate/Competitorn/a
Meas. Tech.Enzyme Assay
IC50<10±n/a nM
Citation Vechorkin, OLi, YSokolsky, AWang, AZhu, WZhuo, J Heterocyclic compounds useful as pim kinase inhibitors US Patent US9920032 Publication Date 3/20/2018
 
Serine/threonine-protein kinase pim-3
Name:Serine/threonine-protein kinase pim-3
Type:Protein
Mol. Mass.:35888.19
Organism:Homo sapiens (Human)
Description:Q86V86
Residue:326
BDBM376824
NameBDBM376824
Synonyms:N-(4-((1R,3S,5S)-3-Amino-5-methylcyclohexyl]pyridin-3-yl}-5-fluoro-3-[(2S,4R)-4-methoxy-2-methylpyrrolidin-1-yl]quinoline-8-carboxamide US11053215, Example 155 | US9920032, Example 155
TypeSmall organic molecule
Emp. Form.C28H34FN5O2
Mol. Mass.491.6003
SMILESCO[C@@H]1C[C@H](C)N(C1)c1cnc2c(ccc(F)c2c1)C(=O)Nc1cnccc1[C@@H]1C[C@H](C)C[C@H](N)C1