Reaction Details
TargetNuclear receptor ROR-gamma
LigandBDBM368656
Substrate/Competitorn/a
IC50 2.10±n/a nM
Citation Schnute, ME Methyl- and trifluoromethyl-substituted pyrrolopyridine modulators of RORC2 and methods of use thereof US Patent US9920054 Publication Date 3/20/2018
 
Nuclear receptor ROR-gamma
Name:Nuclear receptor ROR-gamma
Type:Enzyme Catalytic Domain
Mol. Mass.:58218.40
Organism:Homo sapiens (Human)
Description:P51449
Residue:518
BDBM368656
NameBDBM368656
Synonyms:3-cyano-N-(3-((1R,5S,8r)-3-isobutyryl-3- azabicyclo[3.2.1]octan-8-yl)-1-methyl-4- (trifluoromethyl)-1H-pyrrolo[2,3-b]pyridin-5-yl)-4- methoxybenzamide. US10426135, Example 78 | US9920054, Example 78
TypeSmall organic molecule
Emp. Form.C29H30F3N5O3
Mol. Mass.553.5754
SMILESCOc1ccc(cc1C#N)C(=O)Nc1cnc2n(C)cc(C3[C@H]4CC[C@@H]3CN(C4)C(=O)C(C)C)c2c1C(F)(F)F