Reaction Details
TargetNuclear receptor ROR-gamma
LigandBDBM190346
Substrate/Competitorn/a
IC50 2.70±n/a nM
Citation Schnute, ME Methyl- and trifluoromethyl-substituted pyrrolopyridine modulators of RORC2 and methods of use thereof US Patent US9920054 Publication Date 3/20/2018
 
Nuclear receptor ROR-gamma
Name:Nuclear receptor ROR-gamma
Type:Enzyme Catalytic Domain
Mol. Mass.:58218.40
Organism:Homo sapiens (Human)
Description:P51449
Residue:518
BDBM190346
NameBDBM190346
Synonyms:US10227346, Example 95 US9670201, 95 3-cyano-N-(3-((2S,4R)-1-isobutyryl-2-methylpiperidin-4-yl)-1-methyl-4-(trifluoromethyl)-1H-pyrrolo[2,3-b]pyridin-5-yl)benzamide | US9920054, Example 95
TypeSmall organic molecule
Emp. Form.C27H28F3N5O2
Mol. Mass.511.5387
SMILESCC(C)C(=O)N1CC[C@H](C[C@@H]1C)c1cn(C)c2ncc(NC(=O)c3cccc(c3)C#N)c(c12)C(F)(F)F