Reaction Details
TargetKinesin-like protein KIF11
LigandBDBM23780
Substrate/CompetitorBDBM2
Meas. Tech.Inhibition of Eg5 ATPase Activity
pH6.9±n/a
Temperature295.15±n/a K
Ki 200±n/a nM
Citation Debonis, SSkoufias, DAIndorato, RLLiger, FMarquet, BLaggner, CJoseph, BKozielski, F Structure-activity relationship of S-trityl-L-cysteine analogues as inhibitors of the human mitotic kinesin Eg5. J Med Chem51:1115-25 (2008) 
 
Kinesin-like protein KIF11
Name:Kinesin-like protein KIF11
Type:PROTEIN
Mol. Mass.:119138.97
Organism:Homo sapiens (Human)
Description:ChEMBL_1457426
Residue:1056
BDBM23780
BDBM2
NameBDBM23780
Synonyms:(2R)-2-amino-3-[(naphthalen-2-yldiphenylmethyl)sulfanyl]propanoic acid | S-Trityl-L-Cysteine (STLC) Analogue, 9
TypeSmall organic molecule
Emp. Form.C26H23NO2S
Mol. Mass.413.531
SMILESN[C@@H](CSC(c1ccccc1)(c1ccccc1)c1ccc2ccccc2c1)C(O)=O