Reaction Details
TargetKinesin-like protein KIF11
LigandBDBM23802
Substrate/CompetitorBDBM2
Meas. Tech.Inhibition of Eg5 ATPase Activity
Temperature298.15±n/a K
Ki 150±n/a nM
Commentsextracted
Citation Debonis, SSkoufias, DAIndorato, RLLiger, FMarquet, BLaggner, CJoseph, BKozielski, F Structure-activity relationship of S-trityl-L-cysteine analogues as inhibitors of the human mitotic kinesin Eg5. J Med Chem51:1115-25 (2008) 
 
Kinesin-like protein KIF11
Name:Kinesin-like protein KIF11
Type:PROTEIN
Mol. Mass.:119138.97
Organism:Homo sapiens (Human)
Description:ChEMBL_1457426
Residue:1056
BDBM23802
BDBM2
NameBDBM23802
Synonyms:2-[(triphenylmethyl)sulfanyl]ethan-1-amine | Triphenylmethyl-containing compound, 31
TypeSmall organic molecule
Emp. Form.C21H21NS
Mol. Mass.319.463
SMILESNCCSC(c1ccccc1)(c1ccccc1)c1ccccc1