Reaction Details
TargetKinesin-like protein KIF11
LigandBDBM23822
Substrate/CompetitorBDBM2
Meas. Tech.Inhibition of Eg5 ATPase Activity
Temperature298.15±n/a K
Ki 100±n/a nM
Commentsextracted
Citation Debonis, SSkoufias, DAIndorato, RLLiger, FMarquet, BLaggner, CJoseph, BKozielski, F Structure-activity relationship of S-trityl-L-cysteine analogues as inhibitors of the human mitotic kinesin Eg5. J Med Chem51:1115-25 (2008) 
 
Kinesin-like protein KIF11
Name:Kinesin-like protein KIF11
Type:PROTEIN
Mol. Mass.:119138.97
Organism:Homo sapiens (Human)
Description:ChEMBL_1457426
Residue:1056
BDBM23822
BDBM2
NameBDBM23822
Synonyms:(2R)-2-amino-3-{[(4-methylphenyl)diphenylmethyl]sulfanyl}propanoic acid | S-Trityl-L-Cysteine (STLC) Analogue, 51
TypeSmall organic molecule
Emp. Form.C23H23NO2S
Mol. Mass.377.499
SMILESCc1ccc(cc1)C(SC[C@H](N)C(O)=O)(c1ccccc1)c1ccccc1