Reaction Details
TargetAlpha-glucosidase MAL32
LigandBDBM23852
Substrate/CompetitorBDBM23837
Meas. Tech.alpha-Glucosidase Inhibition Assay
pH7±n/a
Temperature310.15±n/a K
IC50 15000±n/a nM
Citation Dodo, KAoyama, ANoguchi-Yachide, TMakishima, MMiyachi, HHashimoto, Y Co-existence of alpha-glucosidase-inhibitory and liver X receptor-regulatory activities and their separation by structural development. Bioorg Med Chem16:4272-85 (2008) 
 
Alpha-glucosidase MAL32
Name:Alpha-glucosidase MAL32
Type:Hydrolase
Mol. Mass.:68132.36
Organism:Saccharomyces cerevisiae
Description:Purchased from Wako Fine Chemicals Co. Ltd.
Residue:584
BDBM23852
BDBM23837
NameBDBM23852
Synonyms:14-oxapentacyclo[20.2.2.2^{10,13}.1^{15,19}.0^{2,7}]nonacosa-1(24),2(7),3,5,10,12,15,17,19(27),22,25,28-dodecaen-16-ol | Riccardin C derivative, 20e
TypeSmall organic molecule
Emp. Form.C28H24O2
Mol. Mass.392.489
SMILESOc1ccc2CCc3ccc(cc3)-c3ccccc3CCc3ccc(Oc1c2)cc3