Reaction Details
TargetCalpain-1 catalytic subunit
LigandBDBM23855
Substrate/CompetitorBDBM23856
Meas. Tech.mu-Calpain Inhibition Assay
pH7.4±n/a
Temperature295.15±n/a K
Ki 1048±19 nM
Citation Donkor, IOAssefa, HLiu, J Structural basis for the potent calpain inhibitory activity of peptidyl alpha-ketoacids. J Med Chem51:4346-50 (2008) 
 
Calpain-1 catalytic subunit
Name:Calpain-1 catalytic subunit
Type:Catalytic subunit; forms a heterodimer with a small (regulatory) subunit (CAPNS1)
Mol. Mass.:81729.82
Organism:Sus scrofa (pig)
Description:Native calpain-1 from porcine erythrocytes, purchased from Calbiochem, was used in assay.
Residue:714
BDBM23855
BDBM23856
NameBDBM23855
Synonyms:Peptidyl alpha-Ketoester, 1a | methyl 3-[(2S)-2-(3-cyclohexylpropanamido)-4-methylpentanamido]-2-oxo-4-phenylbutanoate
TypeSmall organic molecule
Emp. Form.C26H38N2O5
Mol. Mass.458.5903
SMILESCOC(=O)C(=O)C(Cc1ccccc1)NC(=O)[C@H](CC(C)C)NC(=O)CCC1CCCCC1