Reaction Details
TargetCalpain-1 catalytic subunit
LigandBDBM23857
Substrate/CompetitorBDBM23856
Meas. Tech.mu-Calpain Inhibition Assay
pH7.4±n/a
Temperature295.15±n/a K
Ki 50±6 nM
Citation Donkor, IOAssefa, HLiu, J Structural basis for the potent calpain inhibitory activity of peptidyl alpha-ketoacids. J Med Chem51:4346-50 (2008) 
 
Calpain-1 catalytic subunit
Name:Calpain-1 catalytic subunit
Type:Catalytic subunit; forms a heterodimer with a small (regulatory) subunit (CAPNS1)
Mol. Mass.:81729.82
Organism:Sus scrofa (pig)
Description:Native calpain-1 from porcine erythrocytes, purchased from Calbiochem, was used in assay.
Residue:714
BDBM23857
BDBM23856
NameBDBM23857
Synonyms:3-[(2S)-2-(3-cyclohexylpropanamido)-4-methylpentanamido]-2-oxo-4-phenylbutanoic acid | Peptidyl alpha-Ketoacid, 2a
TypeSmall organic molecule
Emp. Form.C25H36N2O5
Mol. Mass.444.5637
SMILESCC(C)C[C@H](NC(=O)CCC1CCCCC1)C(=O)NC(Cc1ccccc1)C(=O)C(O)=O