Reaction Details
TargetCalpain-1 catalytic subunit
LigandBDBM23859
Substrate/CompetitorBDBM23856
Meas. Tech.mu-Calpain Inhibition Assay
pH7.4±n/a
Temperature295.15±n/a K
Ki 41±7 nM
Citation Donkor, IOAssefa, HLiu, J Structural basis for the potent calpain inhibitory activity of peptidyl alpha-ketoacids. J Med Chem51:4346-50 (2008) 
 
Calpain-1 catalytic subunit
Name:Calpain-1 catalytic subunit
Type:Catalytic subunit; forms a heterodimer with a small (regulatory) subunit (CAPNS1)
Mol. Mass.:81729.82
Organism:Sus scrofa (pig)
Description:Native calpain-1 from porcine erythrocytes, purchased from Calbiochem, was used in assay.
Residue:714
BDBM23859
BDBM23856
NameBDBM23859
Synonyms:3-[(2S)-2-[1-(adamantan-1-yl)acetamido]-4-methylpentanamido]-2-oxo-4-phenylbutanoic acid | Peptidyl alpha-Ketoacid, 2b
TypeSmall organic molecule
Emp. Form.C28H38N2O5
Mol. Mass.482.6117
SMILESCC(C)C[C@H](NC(=O)CC12CC3CC(CC(C3)C1)C2)C(=O)NC(Cc1ccccc1)C(=O)C(O)=O