Reaction Details
TargetCalpain-1 catalytic subunit
LigandBDBM23864
Substrate/CompetitorBDBM23856
Meas. Tech.mu-Calpain Inhibition Assay
pH7.4±n/a
Temperature295.15±n/a K
Ki 1200±15 nM
Citation Donkor, IOAssefa, HLiu, J Structural basis for the potent calpain inhibitory activity of peptidyl alpha-ketoacids. J Med Chem51:4346-50 (2008) 
 
Calpain-1 catalytic subunit
Name:Calpain-1 catalytic subunit
Type:Catalytic subunit; forms a heterodimer with a small (regulatory) subunit (CAPNS1)
Mol. Mass.:81729.82
Organism:Sus scrofa (pig)
Description:Native calpain-1 from porcine erythrocytes, purchased from Calbiochem, was used in assay.
Residue:714
BDBM23864
BDBM23856
NameBDBM23864
Synonyms:Peptidyl alpha-Ketoester, 1e | methyl 3-[(2S)-2-[1-(9H-fluoren-9-yl)acetamido]-4-methylpentanamido]-2-oxo-4-phenylbutanoate
TypeSmall organic molecule
Emp. Form.C32H34N2O5
Mol. Mass.526.6228
SMILESCOC(=O)C(=O)C(Cc1ccccc1)NC(=O)[C@H](CC(C)C)NC(=O)CC1c2ccccc2-c2ccccc12