Reaction Details
TargetSuppressor of tumorigenicity 14 protein
LigandBDBM23918
Substrate/CompetitorBDBM23868
Meas. Tech.Determination of Inhibition Constants
Ki 3.9±n/a nM
Citation Steinmetzer, TSchweinitz, AStürzebecher, ADönnecke, DUhland, KSchuster, OSteinmetzer, PMüller, FFriedrich, RThan, MEBode, WStürzebecher, J Secondary amides of sulfonylated 3-amidinophenylalanine. New potent and selective inhibitors of matriptase. J Med Chem49:4116-26 (2006) 
 
Suppressor of tumorigenicity 14 protein
Name:Suppressor of tumorigenicity 14 protein
Type:Single-pass type II membrane protein
Mol. Mass.:94769.23
Organism:Homo sapiens (Human)
Description:Q9Y5Y6
Residue:855
BDBM23918
BDBM23868
NameBDBM23918
Synonyms:3-amidinophenylalanine deriv., 60 | 4-amino-N-(3-{[(2S)-1-[4-(2-aminoethyl)piperidin-1-yl]-3-(3-carbamimidoylphenyl)-1-oxopropan-2-yl]sulfamoyl}phenyl)butanamide
TypeSmall organic molecule
Emp. Form.C27H39N7O4S
Mol. Mass.557.708
SMILESNCCCC(=O)Nc1cccc(c1)S(=O)(=O)N[C@@H](Cc1cccc(c1)C(N)=N)C(=O)N1CCC(CCN)CC1