Reaction Details
TargetSuppressor of tumorigenicity 14 protein
LigandBDBM23921
Substrate/CompetitorBDBM23868
Meas. Tech.Determination of Inhibition Constants
Ki 1.5±n/a nM
Citation Steinmetzer, TSchweinitz, AStürzebecher, ADönnecke, DUhland, KSchuster, OSteinmetzer, PMüller, FFriedrich, RThan, MEBode, WStürzebecher, J Secondary amides of sulfonylated 3-amidinophenylalanine. New potent and selective inhibitors of matriptase. J Med Chem49:4116-26 (2006) 
 
Suppressor of tumorigenicity 14 protein
Name:Suppressor of tumorigenicity 14 protein
Type:Single-pass type II membrane protein
Mol. Mass.:94769.23
Organism:Homo sapiens (Human)
Description:Q9Y5Y6
Residue:855
BDBM23921
BDBM23868
NameBDBM23921
Synonyms:3-amidinophenylalanine deriv., 63 | 3-amino-N-(3-{[(2S)-1-[4-(3-carbamimidamidopropyl)piperidin-1-yl]-3-(3-carbamimidoylphenyl)-1-oxopropan-2-yl]sulfamoyl}phenyl)propanamide
TypeSmall organic molecule
Emp. Form.C28H41N9O4S
Mol. Mass.599.748
SMILES[#7]-[#6]-[#6]-[#6](=O)-[#7]-c1cccc(c1)S(=O)(=O)[#7]-[#6@@H](-[#6]-c1cccc(c1)-[#6](-[#7])=[#7])-[#6](=O)-[#7]-1-[#6]-[#6]-[#6](-[#6]-[#6]-[#6]\[#7]=[#6](\[#7])-[#7])-[#6]-[#6]-1