Reaction Details
TargetCoagulation factor X
LigandBDBM23910
Substrate/CompetitorBDBM23925
Meas. Tech.Determination of Inhibition Constants
Ki 1000±n/a nM
Citation Steinmetzer, TSchweinitz, AStürzebecher, ADönnecke, DUhland, KSchuster, OSteinmetzer, PMüller, FFriedrich, RThan, MEBode, WStürzebecher, J Secondary amides of sulfonylated 3-amidinophenylalanine. New potent and selective inhibitors of matriptase. J Med Chem49:4116-26 (2006) 
 
Coagulation factor X
Name:Coagulation factor X
Type:PROTEIN
Mol. Mass.:54498.45
Organism:Bos taurus
Description:ChEMBL_1364435
Residue:492
BDBM23910
BDBM23925
NameBDBM23910
Synonyms:3-[(2S)-3-[4-(2-carbamimidamidoethyl)piperidin-1-yl]-3-oxo-2-[(4-phenoxybenzene)sulfonamido]propyl]benzene-1-carboximidamide | 3-amidinophenylalanine deriv., 53
TypeSmall organic molecule
Emp. Form.C30H37N7O4S
Mol. Mass.591.724
SMILES[#7]\[#6](-[#7])=[#7]\[#6]-[#6]-[#6]-1-[#6]-[#6]-[#7](-[#6]-[#6]-1)-[#6](=O)-[#6@H](-[#6]-c1cccc(c1)-[#6](-[#7])=[#7])-[#7]S(=O)(=O)c1ccc(-[#8]-c2ccccc2)cc1