Reaction Details
TargetALK tyrosine kinase receptor [L1196M]
LigandBDBM261636
Substrate/Competitorn/a
Meas. Tech.ELISA-Based in vitro Kinase Assay
pH7.5±n/a
Temperature298.15±n/a K
IC50 300±n/a nM
Commentsextracted
Citation Gambacorti-Passerini, CMologni, LScapozza, LBisson, WGoekjian, PD Attoma, J 2-acylaminothiazoles for the treatment of cancer US Patent US9708279 Publication Date 7/18/2017
 
ALK tyrosine kinase receptor [L1196M]
Name:ALK tyrosine kinase receptor [L1196M]
Type:n/a
Mol. Mass.:176471.13
Organism:Homo sapiens (Human)
Description:Q9UM73[L1196M]
Residue:1620
BDBM261636
NameBDBM261636
Synonyms:N-(4-(3,4-bis((2-(trifluoromethyl)phenyl)ethynyl)phenyl)thiazol-2-yl)-4-((4-methylpiperazin-1-yl)methyl)benzamide | US9708279, 13
TypeSmall organic molecule
Emp. Form.C40H30F6N4OS
Mol. Mass.728.748
SMILESCN1CCN(Cc2ccc(cc2)C(=O)Nc2nc(cs2)-c2ccc(C#Cc3ccccc3C(F)(F)F)c(c2)C#Cc2ccccc2C(F)(F)F)CC1