Reaction Details
TargetAryl hydrocarbon receptor
LigandBDBM23931
Substrate/CompetitorBDBM23927
Meas. Tech.In Vitro Binding Assay
pH7.6±n/a
Temperature277.15±n/a K
Ki 3.8±2.2 nM
CommentsAntagonist.
Citation de Medina, PCasper, RSavouret, JFPoirot, M Synthesis and biological properties of new stilbene derivatives of resveratrol as new selective aryl hydrocarbon modulators. J Med Chem48:287-91 (2005) 
 
Aryl hydrocarbon receptor
Name:Aryl hydrocarbon receptor
Type:Transcription factor
Mol. Mass.:94428.00
Organism:Oryctolagus cuniculus (rabbit)
Description:Cytosols from rabbit liver were used in binding assay.
Residue:847
BDBM23931
BDBM23927
NameBDBM23931
Synonyms:1,3-difluoro-5-[(E)-2-(4-fluorophenyl)ethenyl]benzene | trans-Stilbene Derivative, 4d
TypeSmall organic molecule
Emp. Form.C14H9F3
Mol. Mass.234.2165
SMILESFc1ccc(\C=C\c2cc(F)cc(F)c2)cc1