Reaction Details
TargetTyrosine-protein kinase BTK
LigandBDBM377726
Substrate/Competitorn/a
Meas. Tech.Human BTK LanthaScreen Assay
IC50 1.000±n/a nM
Citation Springer, JRDevadas, BGarland, DJGrapperhaus, MLHan, SHockerman, SLHughes, ROSaiah, ESchnute, MESelness, SRWalker, DPWan, ZXing, LZapf, CWSchmidt, MA Bruton's tyrosine kinase inhibitors US Patent US10266513 Publication Date 4/23/2019
 
Tyrosine-protein kinase BTK
Name:Tyrosine-protein kinase BTK
Type:Enzyme
Mol. Mass.:76289.95
Organism:Homo sapiens (Human)
Description:Q06187
Residue:659
BDBM377726
NameBDBM377726
Synonyms:5-amino-3-[4-(4-chloro-2-methylphenoxy)phenyl]-1-(1-cyanopiperidin-3-yl)-1H-pyrazole-4-carboxamide US10266513, Example 21 US10815213, Example 22
TypeSmall organic molecule
Emp. Form.C23H23ClN6O2
Mol. Mass.450.921
SMILESCc1cc(Cl)ccc1Oc1ccc(cc1)-c1nn(C2CCCN(C2)C#N)c(N)c1C(N)=O