Reaction Details
TargetTyrosine-protein kinase BTK
LigandBDBM377748
Substrate/Competitorn/a
Meas. Tech.Human BTK LanthaScreen Assay
IC50 1.20±n/a nM
Citation Springer, JRDevadas, BGarland, DJGrapperhaus, MLHan, SHockerman, SLHughes, ROSaiah, ESchnute, MESelness, SRWalker, DPWan, ZXing, LZapf, CWSchmidt, MA Bruton's tyrosine kinase inhibitors US Patent US10266513 Publication Date 4/23/2019
 
Tyrosine-protein kinase BTK
Name:Tyrosine-protein kinase BTK
Type:Enzyme
Mol. Mass.:76289.95
Organism:Homo sapiens (Human)
Description:Q06187
Residue:659
BDBM377748
NameBDBM377748
Synonyms:5-amino-1-(1-cyanopiperidin-3-yl)-3-[4-(4-methylphenoxy)phenyl]-1H-pyrazole-4-carboxamide US10815213, Example 42
TypeSmall organic molecule
Emp. Form.C23H24N6O2
Mol. Mass.416.4757
SMILESCc1ccc(Oc2ccc(cc2)-c2nn(C3CCCN(C3)C#N)c(N)c2C(N)=O)cc1