Reaction Details
TargetTyrosine-protein kinase BTK
LigandBDBM377836
Substrate/Competitorn/a
Meas. Tech.Human BTK LanthaScreen Assay
IC50 0.170±n/a nM
Citation Springer, JRDevadas, BGarland, DJGrapperhaus, MLHan, SHockerman, SLHughes, ROSaiah, ESchnute, MESelness, SRWalker, DPWan, ZXing, LZapf, CWSchmidt, MA Bruton's tyrosine kinase inhibitors US Patent US10266513 Publication Date 4/23/2019
 
Tyrosine-protein kinase BTK
Name:Tyrosine-protein kinase BTK
Type:Enzyme
Mol. Mass.:76289.95
Organism:Homo sapiens (Human)
Description:Q06187
Residue:659
BDBM377836
NameBDBM377836
Synonyms:1-[(3R)-1-acryloyl piperidin-3-yl]-5-amino-3-[4-(4-chlorophenoxy)phenyl]-1H-pyrazole-4-carboxamide | US10266513, Example 130
TypeSmall organic molecule
Emp. Form.C24H24ClN5O3
Mol. Mass.465.932
SMILESNC(=O)c1c(N)n(nc1-c1ccc(Oc2ccc(Cl)cc2)cc1)[C@@H]1CCCN(C1)C(=O)C=C