Reaction Details
TargetTyrosine-protein kinase BTK
LigandBDBM377839
Substrate/Competitorn/a
Meas. Tech.Human BTK LanthaScreen Assay
IC50 0.380±n/a nM
Citation Springer, JRDevadas, BGarland, DJGrapperhaus, MLHan, SHockerman, SLHughes, ROSaiah, ESchnute, MESelness, SRWalker, DPWan, ZXing, LZapf, CWSchmidt, MA Bruton's tyrosine kinase inhibitors US Patent US10266513 Publication Date 4/23/2019
 
Tyrosine-protein kinase BTK
Name:Tyrosine-protein kinase BTK
Type:Enzyme
Mol. Mass.:76289.95
Organism:Homo sapiens (Human)
Description:Q06187
Residue:659
BDBM377839
NameBDBM377839
Synonyms:5-amino-3-[4-(4-chlorophenoxy)phenyl]-1-{(3R)-1-[(2E)-4,4-difluorobut-2-enoyl]piperidin-3-yl}-1H-pyrazole-4-carboxamide US10815213, Example 133
TypeSmall organic molecule
Emp. Form.C25H24ClF2N5O3
Mol. Mass.515.94
SMILESNC(=O)c1c(N)n(nc1-c1ccc(Oc2ccc(Cl)cc2)cc1)C1CCCN(C1)C(=O)\C=C\C(F)F