Reaction Details
TargetTyrosine-protein kinase BTK
LigandBDBM377842
Substrate/Competitorn/a
Meas. Tech.Human BTK LanthaScreen Assay
IC50 0.250±n/a nM
Citation Springer, JRDevadas, BGarland, DJGrapperhaus, MLHan, SHockerman, SLHughes, ROSaiah, ESchnute, MESelness, SRWalker, DPWan, ZXing, LZapf, CWSchmidt, MA Bruton's tyrosine kinase inhibitors US Patent US10266513 Publication Date 4/23/2019
 
Tyrosine-protein kinase BTK
Name:Tyrosine-protein kinase BTK
Type:Enzyme
Mol. Mass.:76289.95
Organism:Homo sapiens (Human)
Description:Q06187
Residue:659
BDBM377842
NameBDBM377842
Synonyms:1-[(3S)-1-acryloyl piperidin-3-yl]-5-amino-3-[4-(2,4-difluorophenoxy)phenyl]-1H-pyrazole-4-carboxamide US10266513, Example 137 | US10815213, Example 137
TypeSmall organic molecule
Emp. Form.C24H23F2N5O3
Mol. Mass.467.4679
SMILESNC(=O)c1c(N)n(nc1-c1ccc(Oc2ccc(F)cc2F)cc1)C1CCCN(C1)C(=O)C=C