Reaction Details
TargetHistone-lysine N-methyltransferase SMYD3
LigandBDBM378448
Substrate/Competitorn/a
Meas. Tech.SMYD3 Biochemical Assay
IC50 0.950±n/a nM
Citation Foley, MAKuntz, KWMills, JEMitchell, LHMunchhof, MJHarvey, DM Substituted 1,2,3-triazoles as SMYD inhibitors for treating cancer US Patent US10266526 Publication Date 4/23/2019
 
Histone-lysine N-methyltransferase SMYD3
Name:Histone-lysine N-methyltransferase SMYD3
Type:Enzyme
Mol. Mass.:49101.22
Organism:Homo sapiens (Human)
Description:Q9H7B4-2
Residue:428
BDBM378448
NameBDBM378448
Synonyms:N-((1R,3r,5S)-8-(((1-(3-hydroxypropyl)piperidin-4-yl)methyl)sulfonyl)-8-azabicyclo[3.2.1]octan-3-yl)-2-oxoindoline-5-carboxamide | US10266526, Compound 581
TypeSmall organic molecule
Emp. Form.C25H36N4O5S
Mol. Mass.504.642
SMILESOCCCN1CCC(CS(=O)(=O)N2[C@H]3CC[C@@H]2C[C@@H](C3)NC(=O)c2ccc3NC(=O)Cc3c2)CC1