Reaction Details
TargetHistone-lysine N-methyltransferase SMYD3
LigandBDBM378459
Substrate/Competitorn/a
Meas. Tech.SMYD3 Biochemical Assay
IC50 2.58±n/a nM
Citation Foley, MAKuntz, KWMills, JEMitchell, LHMunchhof, MJHarvey, DM Substituted 1,2,3-triazoles as SMYD inhibitors for treating cancer US Patent US10266526 Publication Date 4/23/2019
 
Histone-lysine N-methyltransferase SMYD3
Name:Histone-lysine N-methyltransferase SMYD3
Type:Enzyme
Mol. Mass.:49101.22
Organism:Homo sapiens (Human)
Description:Q9H7B4-2
Residue:428
BDBM378459
NameBDBM378459
Synonyms:N-((1R,3r,5S)-8-((4-(benzylamino)piperidin-1-yl)sulfonyl)-8-azabicyclo[3.2.1]octan-3-yl)-6-chloro-2-oxoindoline-5-carboxamide | US10266526, Compound 592
TypeSmall organic molecule
Emp. Form.C28H34ClN5O4S
Mol. Mass.572.119
SMILESClc1cc2NC(=O)Cc2cc1C(=O)N[C@@H]1C[C@@H]2CC[C@H](C1)N2S(=O)(=O)N1CCC(CC1)NCc1ccccc1