Reaction Details
TargetN-lysine methyltransferase SMYD2
LigandBDBM378802
Substrate/Competitorn/a
Meas. Tech.SMYD2 Biochemical Assay
IC50 3.90±n/a nM
Citation Foley, MAKuntz, KWMills, JEMitchell, LHMunchhof, MJHarvey, DM Substituted 1,2,3-triazoles as SMYD inhibitors for treating cancer US Patent US10266526 Publication Date 4/23/2019
 
N-lysine methyltransferase SMYD2
Name:N-lysine methyltransferase SMYD2
Type:Enzyme
Mol. Mass.:49689.57
Organism:Homo sapiens (Human)
Description:Q9NRG4
Residue:433
BDBM378802
NameBDBM378802
Synonyms:N-(1-((1-(4-chlorobenzyl)-1H-pyrazol-4-yl)methyl)azetidin-3-yl)-1-cyclopropyl-1H-1,2,3-triazole-4-carboxamide | US10266526, Compound 985
TypeSmall organic molecule
Emp. Form.C20H22ClN7O
Mol. Mass.411.888
SMILESClc1ccc(Cn2cc(CN3CC(C3)NC(=O)c3cn(nn3)C3CC3)cn2)cc1