Reaction Details
TargetA disintegrin and metalloproteinase with thrombospondin motifs 5
LigandBDBM24058
Substrate/CompetitorBDBM2
Meas. Tech.Kinesin ATPase In Vitro Assay
pH7±n/a
Temperature296.15±n/a K
IC50 3.6±n/a nM
Citation Fraley, MEGarbaccio, RMArrington, KLHoffman, WFTasber, ESColeman, PJBuser, CAWalsh, ESHamilton, KFernandes, CSchaber, MDLobell, RBTao, WSouth, VJYan, YKuo, LCPrueksaritanont, TShu, CTorrent, MHeimbrook, DCKohl, NEHuber, HEHartman, GD Kinesin spindle protein (KSP) inhibitors. Part 2: the design, synthesis, and characterization of 2,4-diaryl-2,5-dihydropyrrole inhibitors of the mitotic kinesin KSP. Bioorg Med Chem Lett16:1775-9 (2006) 
 
A disintegrin and metalloproteinase with thrombospondin motifs 5
Name:A disintegrin and metalloproteinase with thrombospondin motifs 5
Type:Enzyme
Mol. Mass.:101769.09
Organism:Homo sapiens (Human)
Description:Q9UNA0
Residue:930
BDBM24058
BDBM2
NameBDBM24058
Synonyms:(2S)-2-amino-1-[(2S)-4-(2,5-difluorophenyl)-2-phenyl-2,5-dihydro-1H-pyrrol-1-yl]-3-methylbutan-1-one | dihydropyrrole, 17
TypeSmall organic molecule
Emp. Form.C21H22F2N2O
Mol. Mass.356.409
SMILES[H][C@]1(C=C(CN1C(=O)[C@@H](N)C(C)C)c1cc(F)ccc1F)c1ccccc1