Reaction Details
TargetA disintegrin and metalloproteinase with thrombospondin motifs 5
LigandBDBM24065
Substrate/CompetitorBDBM2
Meas. Tech.Kinesin ATPase In Vitro Assay
pH7±n/a
Temperature296.15±n/a K
IC50 24.7±7.5 nM
Citation Cox, CDTorrent, MBreslin, MJMariano, BJWhitman, DBColeman, PJBuser, CAWalsh, ESHamilton, KSchaber, MDLobell, RBTao, WSouth, VJKohl, NEYan, YKuo, LCPrueksaritanont, TSlaughter, DELi, CMahan, ELu, BHartman, GD Kinesin spindle protein (KSP) inhibitors. Part 4: Structure-based design of 5-alkylamino-3,5-diaryl-4,5-dihydropyrazoles as potent, water-soluble inhibitors of the mitotic kinesin KSP. Bioorg Med Chem Lett16:3175-9 (2006) 
 
A disintegrin and metalloproteinase with thrombospondin motifs 5
Name:A disintegrin and metalloproteinase with thrombospondin motifs 5
Type:Enzyme
Mol. Mass.:101769.09
Organism:Homo sapiens (Human)
Description:Q9UNA0
Residue:930
BDBM24065
BDBM2
NameBDBM24065
Synonyms:1-[(5S)-3-(2,5-difluorophenyl)-5-(3-hydroxyphenyl)-4,5-dihydro-1H-pyrazol-1-yl]ethan-1-one CHEMBL195232
TypeSmall organic molecule
Emp. Form.C17H14F2N2O2
Mol. Mass.316.3021
SMILESCC(=O)N1N=C(C[C@H]1c1cccc(O)c1)c1cc(F)ccc1F