Reaction Details
TargetA disintegrin and metalloproteinase with thrombospondin motifs 5
LigandBDBM24097
Substrate/CompetitorBDBM2
Meas. Tech.Kinesin ATPase In Vitro Assay
pH7±n/a
Temperature296.15±n/a K
IC50 2.1±n/a nM
Citation Roecker, AJColeman, PJMercer, SPSchreier, JDBuser, CAWalsh, ESHamilton, KLobell, RBTao, WDiehl, RESouth, VJDavide, JPKohl, NEYan, YKuo, LCLi, CFernandez-Metzler, CMahan, EAPrueksaritanont, THartman, GD Kinesin spindle protein (KSP) inhibitors. Part 8: Design and synthesis of 1,4-diaryl-4,5-dihydropyrazoles as potent inhibitors of the mitotic kinesin KSP. Bioorg Med Chem Lett17:5677-82 (2007) 
 
A disintegrin and metalloproteinase with thrombospondin motifs 5
Name:A disintegrin and metalloproteinase with thrombospondin motifs 5
Type:Enzyme
Mol. Mass.:101769.09
Organism:Homo sapiens (Human)
Description:Q9UNA0
Residue:930
BDBM24097
BDBM2
NameBDBM24097
Synonyms:1,4-diaryl-4,5-dihydropyrazole, 17 Racemate
TypeSmall organic molecule
Emp. Form.C22H25F2N3O
Mol. Mass.385.4502
SMILESCN(C)CCCC1(CN(N=C1C(C)=O)c1cc(F)ccc1F)c1ccccc1