Reaction Details
TargetA disintegrin and metalloproteinase with thrombospondin motifs 5
LigandBDBM24102
Substrate/CompetitorBDBM2
Meas. Tech.Kinesin ATPase In Vitro Assay
pH7±n/a
Temperature296.15±n/a K
IC50 2.0±n/a nM
Citation Roecker, AJColeman, PJMercer, SPSchreier, JDBuser, CAWalsh, ESHamilton, KLobell, RBTao, WDiehl, RESouth, VJDavide, JPKohl, NEYan, YKuo, LCLi, CFernandez-Metzler, CMahan, EAPrueksaritanont, THartman, GD Kinesin spindle protein (KSP) inhibitors. Part 8: Design and synthesis of 1,4-diaryl-4,5-dihydropyrazoles as potent inhibitors of the mitotic kinesin KSP. Bioorg Med Chem Lett17:5677-82 (2007) 
 
A disintegrin and metalloproteinase with thrombospondin motifs 5
Name:A disintegrin and metalloproteinase with thrombospondin motifs 5
Type:Enzyme
Mol. Mass.:101769.09
Organism:Homo sapiens (Human)
Description:Q9UNA0
Residue:930
BDBM24102
BDBM2
NameBDBM24102
Synonyms:1,4-diaryl-4,5-dihydropyrazole, 22 Racemate
TypeSmall organic molecule
Emp. Form.C27H33FN4O2
Mol. Mass.464.5749
SMILESCC(=O)N1CCN(CCCC2(CN(N=C2C(C)=O)c2cc(C)ccc2F)c2ccccc2)CC1