Reaction Details
TargetMuscarinic acetylcholine receptor M1
LigandBDBM261726
Substrate/Competitorn/a
Meas. Tech.M1 PAM Assay
EC50 273±n/a nM
Citation Groebke Zbinden, KPinard, ERyckmans, T Flouro-naphthyl derivatives US Patent US9708302 Publication Date 7/18/2017
 
Muscarinic acetylcholine receptor M1
Name:Muscarinic acetylcholine receptor M1
Type:Enzyme Catalytic Domain
Mol. Mass.:51390.46
Organism:RAT
Description:P08482
Residue:460
BDBM261726
NameBDBM261726
Synonyms:4-(4-chlorobenzyl)- 1-fluoro-N- ((3RS,4SR)-3- hydroxytetrahydro- 2H-pyran-4-yl)-2- naphthamide | US9708302, 12
TypeSmall organic molecule
Emp. Form.C23H21ClFNO3
Mol. Mass.413.869
SMILESO[C@H]1COCC[C@@H]1NC(=O)c1cc(Cc2ccc(Cl)cc2)c2ccccc2c1F