Reaction Details
TargetMuscarinic acetylcholine receptor M1
LigandBDBM261740
Substrate/Competitorn/a
Meas. Tech.M1 PAM Assay
EC50 345±n/a nM
Citation Groebke Zbinden, KPinard, ERyckmans, T Flouro-naphthyl derivatives US Patent US9708302 Publication Date 7/18/2017
 
Muscarinic acetylcholine receptor M1
Name:Muscarinic acetylcholine receptor M1
Type:Enzyme Catalytic Domain
Mol. Mass.:51390.46
Organism:RAT
Description:P08482
Residue:460
BDBM261740
NameBDBM261740
Synonyms:4-((4-Cyano-4-(pyridin-2-yl)piperidin-1-yl)methyl)-1-fluoro-N-((1S,2S)-2-hydroxycyclohexyl)-2-naphthamide | US9708302, 26
TypeSmall organic molecule
Emp. Form.C29H31FN4O2
Mol. Mass.486.5804
SMILESO[C@H]1CCCC[C@@H]1NC(=O)c1cc(CN2CCC(CC2)(C#N)c2ccccn2)c2ccccc2c1F