Reaction Details
TargetKinesin-like protein KIF11
LigandBDBM24151
Substrate/CompetitorBDBM2
Meas. Tech.Microtubule-Stimulated KSP ATPase Activity Assay
pH7±n/a
Temperature295.15±n/a K
IC50 9900±2100 nM
Citation Pinkerton, ABLee, TTHoffman, TZWang, YKahraman, MCook, TGSeverance, DGahman, TCNoble, SAShiau, AKDavis, RL Synthesis and SAR of thiophene containing kinesin spindle protein (KSP) inhibitors. Bioorg Med Chem Lett17:3562-9 (2007) 
 
Kinesin-like protein KIF11
Name:Kinesin-like protein KIF11
Type:PROTEIN
Mol. Mass.:119138.97
Organism:Homo sapiens (Human)
Description:ChEMBL_1457426
Residue:1056
BDBM24151
BDBM2
NameBDBM24151
Synonyms:N-[3-(diethylcarbamoyl)-4H,5H,6H-cyclopenta[b]thiophen-2-yl]thiophene-2-carboxamide | thiophene containing compound, 14
TypeSmall organic molecule
Emp. Form.C17H20N2O2S2
Mol. Mass.348.483
SMILESCCN(CC)C(=O)c1c(NC(=O)c2cccs2)sc2CCCc12