Reaction Details
TargetKinesin-like protein KIF11
LigandBDBM24157
Substrate/CompetitorBDBM2
Meas. Tech.Microtubule-Stimulated KSP ATPase Activity Assay
pH7±n/a
Temperature295.15±n/a K
IC50 23000±5000 nM
Citation Pinkerton, ABLee, TTHoffman, TZWang, YKahraman, MCook, TGSeverance, DGahman, TCNoble, SAShiau, AKDavis, RL Synthesis and SAR of thiophene containing kinesin spindle protein (KSP) inhibitors. Bioorg Med Chem Lett17:3562-9 (2007) 
 
Kinesin-like protein KIF11
Name:Kinesin-like protein KIF11
Type:PROTEIN
Mol. Mass.:119138.97
Organism:Homo sapiens (Human)
Description:ChEMBL_1457426
Residue:1056
BDBM24157
BDBM2
NameBDBM24157
Synonyms:N-[3-(diethylcarbamoyl)-4,5,6,7-tetrahydro-1-benzothiophen-2-yl]furan-2-carboxamide | furan containing compound, 20
TypeSmall organic molecule
Emp. Form.C18H22N2O3S
Mol. Mass.346.444
SMILESCCN(CC)C(=O)c1c(NC(=O)c2ccco2)sc2CCCCc12