Reaction Details
TargetKinesin-like protein KIF11
LigandBDBM24161
Substrate/CompetitorBDBM2
Meas. Tech.Microtubule-Stimulated KSP ATPase Activity Assay
pH7±n/a
Temperature295.15±n/a K
IC50>100000±n/a nM
Citation Pinkerton, ABLee, TTHoffman, TZWang, YKahraman, MCook, TGSeverance, DGahman, TCNoble, SAShiau, AKDavis, RL Synthesis and SAR of thiophene containing kinesin spindle protein (KSP) inhibitors. Bioorg Med Chem Lett17:3562-9 (2007) 
 
Kinesin-like protein KIF11
Name:Kinesin-like protein KIF11
Type:PROTEIN
Mol. Mass.:119138.97
Organism:Homo sapiens (Human)
Description:ChEMBL_1457426
Residue:1056
BDBM24161
BDBM2
NameBDBM24161
Synonyms:2-(thiophene-2-amido)-4,5,6,7-tetrahydro-1-benzothiophene-3-carboxylic acid thiophene containing compound, 24
TypeSmall organic molecule
Emp. Form.C14H13NO3S2
Mol. Mass.307.388
SMILESOC(=O)c1c(NC(=O)c2cccs2)sc2CCCCc12