Reaction Details
TargetTyrosine-protein kinase Fyn
LigandBDBM378887
Substrate/Competitorn/a
Meas. Tech.Kinase Inhibition Assays
IC50 3.00±n/a nM
Citation Yang, SWei, Y 3-acetylenyl-pyrazole-pyrimidine derivative, and preparation method therefor and uses thereof US Patent US10266537 Publication Date 4/23/2019
 
Tyrosine-protein kinase Fyn
Name:Tyrosine-protein kinase Fyn
Type:Enzyme
Mol. Mass.:60762.21
Organism:Homo sapiens (Human)
Description:P06241
Residue:537
BDBM378887
NameBDBM378887
Synonyms:US10266537, Compound 31
TypeSmall organic molecule
Emp. Form.C28H26F3N7O
Mol. Mass.533.5475
SMILESCN1CCC(CC1)n1nc(C#Cc2cc(NC(=O)c3cccc(c3)C(F)(F)F)ccc2C)c2c(N)ncnc12