Reaction Details
TargetCytoplasmic tyrosine-protein kinase BMX
LigandBDBM378885
Substrate/Competitorn/a
Meas. Tech.Kinase Inhibition Assays
IC50 21.0±n/a nM
Citation Yang, SWei, Y 3-acetylenyl-pyrazole-pyrimidine derivative, and preparation method therefor and uses thereof US Patent US10266537 Publication Date 4/23/2019
 
Cytoplasmic tyrosine-protein kinase BMX
Name:Cytoplasmic tyrosine-protein kinase BMX
Type:Tyrosine-protein kinase
Mol. Mass.:78030.42
Organism:Homo sapiens (Human)
Description:P51813
Residue:675
BDBM378885
NameBDBM378885
Synonyms:US10266537, Compound 93
TypeSmall organic molecule
Emp. Form.C29H27F3N6O2
Mol. Mass.548.5589
SMILESCc1ccc(NC(=O)c2ccc(C)c(c2)C(F)(F)F)cc1C#Cc1nn([C@H]2CC[C@H](O)CC2)c2ncnc(N)c12