Reaction Details
TargetLeukotriene A-4 hydrolase
LigandBDBM24203
Substrate/CompetitorBDBM24200
Meas. Tech.Epoxide Hydrolase Assay
pH7.4±n/a
Temperature295.15±n/a K
IC50 11±8 nM
Citation Grice, CATays, KLSavall, BMWei, JButler, CRAxe, FUBembenek, SDFourie, AMDunford, PJLundeen, KColes, FXue, XRiley, JPWilliams, KNKarlsson, LEdwards, JP Identification of a potent, selective, and orally active leukotriene a4 hydrolase inhibitor with anti-inflammatory activity. J Med Chem51:4150-69 (2008) 
 
Leukotriene A-4 hydrolase
Name:Leukotriene A-4 hydrolase
Type:Hydrolase; metalloprotease
Mol. Mass.:69280.41
Organism:Homo sapiens (Human)
Description:Human recombinant LTA4H.
Residue:611
BDBM24203
BDBM24200
NameBDBM24203
Synonyms:2-{4-[2-(piperidin-1-yl)ethoxy]phenoxy}-1,3-benzoxazole | Benzoxazole compound, 10b
TypeSmall organic molecule
Emp. Form.C20H22N2O3
Mol. Mass.338.4003
SMILESC(CN1CCCCC1)Oc1ccc(Oc2nc3ccccc3o2)cc1